Reaction Details
TargetD(2) dopamine receptor
LigandBDBM86463
Substrate/Competitorn/a
Ki 7±n/a nM
CommentsPDSP_4958
Citation Sit, SYXie, KJacutin-Porte, SBoy, KMSeanz, JTaber, MTGulwadi, AGKorpinen, CDBurris, KDMolski, TFRyan, EXu, CVerdoorn, TJohnson, GNichols, DEMailman, RB Synthesis and SAR exploration of dinapsoline analogues. Bioorg Med Chem12:715-34 (2004) 
 
D(2) dopamine receptor
Name:D(2) dopamine receptor
Type:G Protein-Coupled Receptor (GPCR)
Mol. Mass.:50931.60
Organism:Rattus norvegicus (rat)
Description:P61169
Residue:444
BDBM86463
NameBDBM86463
Synonyms:(+)-6-fluorodinapsoline hydrobromide NSC_0
TypeSmall organic molecule
Emp. Form.C16H14FNO2
Mol. Mass.271.2863
SMILESOc1ccc2[C@@H]3CNCc4ccc(F)c(Cc2c1O)c34