Reaction Details
TargetD(2) dopamine receptor
LigandBDBM86468
Substrate/Competitorn/a
Ki 160±n/a nM
CommentsPDSP_4944
Citation Sit, SYXie, KJacutin-Porte, SBoy, KMSeanz, JTaber, MTGulwadi, AGKorpinen, CDBurris, KDMolski, TFRyan, EXu, CVerdoorn, TJohnson, GNichols, DEMailman, RB Synthesis and SAR exploration of dinapsoline analogues. Bioorg Med Chem12:715-34 (2004) 
 
D(2) dopamine receptor
Name:D(2) dopamine receptor
Type:G Protein-Coupled Receptor (GPCR)
Mol. Mass.:50931.60
Organism:Rattus norvegicus (rat)
Description:P61169
Residue:444
BDBM86468
NameBDBM86468
Synonyms:4-fluoro-2,3,7,11b-tetrahydro-1H-pyrido[3,4,5-k]acridin-8,9-diol
TypeSmall organic molecule
Emp. Form.C15H9FN2O2
Mol. Mass.268.2426
SMILESOc1ccc2c3cncc4c(F)ccc([nH]c2c1O)c34