Reaction Details
TargetKappa-type opioid receptor
LigandBDBM86477
Substrate/Competitorn/a
Ki 0.146±n/a nM
CommentsPDSP_4078
Citation Vanderah, TWSchteingart, CDTrojnar, JJunien, JLLai, JRiviere, PJ FE200041 (D-Phe-D-Phe-D-Nle-D-Arg-NH2): A peripheral efficacious kappa opioid agonist with unprecedented selectivity. J Pharmacol Exp Ther310:326-33 (2004) 
 
Kappa-type opioid receptor
Name:Kappa-type opioid receptor
Type:G Protein-Coupled Receptor (GPCR)
Mol. Mass.:42648.76
Organism:Homo sapiens (Human)
Description:P41145
Residue:380
BDBM86477
NameBDBM86477
Synonyms:FE200041 | d-Phe-d-Phe-d-Nle-d-Arg-NH2
TypeSmall organic molecule
Emp. Form.C30H44N8O4
Mol. Mass.580.7216
SMILES[#6]-[#6]-[#6]-[#6]-[#6@@H](-[#7]-[#6](=O)-[#6@@H](-[#6]-c1ccccc1)-[#7]-[#6](=O)-[#6@H](-[#7])-[#6]-c1ccccc1)-[#6](=O)-[#7]-[#6@H](-[#6]-[#6]-[#6]\[#7]=[#6](/[#7])-[#7])-[#6](-[#7])=O