Reaction Details
TargetNeuronal acetylcholine receptor subunit alpha-2
LigandBDBM86311
Substrate/Competitorn/a
Ki 1.1±n/a nM
CommentsPDSP_608
Citation Xiao, YKellar, KJ The comparative pharmacology and up-regulation of rat neuronal nicotinic receptor subtype binding sites stably expressed in transfected mammalian cells. J Pharmacol Exp Ther310:98-107 (2004) 
 
Neuronal acetylcholine receptor subunit alpha-2
Name:Neuronal acetylcholine receptor subunit alpha-2
Type:Enzyme
Mol. Mass.:58597.25
Organism:Rattus norvegicus (Rat)
Description:P12389
Residue:511
BDBM86311
NameBDBM86311
Synonyms:CAS_485-35-8 Cytisine-(-) US11667638, Example Cytisine
TypeSmall organic molecule
Emp. Form.C11H14N2O
Mol. Mass.190.2417
SMILESO=c1cccc2C3CNCC(C3)Cn12