Reaction Details
TargetNeuronal acetylcholine receptor subunit alpha-2
LigandBDBM50143313
Substrate/Competitorn/a
Ki 6200±n/a nM
CommentsPDSP_3248
Citation Xiao, YKellar, KJ The comparative pharmacology and up-regulation of rat neuronal nicotinic receptor subtype binding sites stably expressed in transfected mammalian cells. J Pharmacol Exp Ther310:98-107 (2004) 
 
Neuronal acetylcholine receptor subunit alpha-2
Name:Neuronal acetylcholine receptor subunit alpha-2
Type:Enzyme
Mol. Mass.:58597.25
Organism:Rattus norvegicus (Rat)
Description:P12389
Residue:511
BDBM50143313
NameBDBM50143313
Synonyms:(12S,13aS)-12-Methoxy-1,4,5,6,9,11,12,13-octahydro-8H-pyrano[4',3':3,4]pyrido[2,1-i]indol-2-one DHbetaE
TypeSmall organic molecule
Emp. Form.C16H21NO3
Mol. Mass.275.3428
SMILESCO[C@H]1CC=C2CCN3CCC4=C(CC(=O)OC4)[C@]23C1