Reaction Details
TargetNeuronal acetylcholine receptor subunit alpha-2
LigandBDBM50171347
Substrate/Competitorn/a
Ki 18±n/a nM
CommentsPDSP_218
Citation Xiao, YKellar, KJ The comparative pharmacology and up-regulation of rat neuronal nicotinic receptor subtype binding sites stably expressed in transfected mammalian cells. J Pharmacol Exp Ther310:98-107 (2004) 
 
Neuronal acetylcholine receptor subunit alpha-2
Name:Neuronal acetylcholine receptor subunit alpha-2
Type:Enzyme
Mol. Mass.:58597.25
Organism:Rattus norvegicus (Rat)
Description:P12389
Residue:511
BDBM50171347
NameBDBM50171347
Synonyms:3-(Azetidin-2-ylmethoxy)-pyridine CHEMBL190589
TypeSmall organic molecule
Emp. Form.C9H12N2O
Mol. Mass.164.2044
SMILESC(Oc1cccnc1)C1CCN1