Reaction Details
TargetNeuronal acetylcholine receptor subunit alpha-4
LigandBDBM86309
Substrate/Competitorn/a
Ki 6400±n/a nM
CommentsPDSP_1228
Citation Xiao, YKellar, KJ The comparative pharmacology and up-regulation of rat neuronal nicotinic receptor subtype binding sites stably expressed in transfected mammalian cells. J Pharmacol Exp Ther310:98-107 (2004) 
 
Neuronal acetylcholine receptor subunit alpha-4
Name:Neuronal acetylcholine receptor subunit alpha-4
Type:Enzyme
Mol. Mass.:70196.44
Organism:Rattus norvegicus (Rat)
Description:P09483
Residue:630
BDBM86309
NameBDBM86309
Synonyms:CAS_21019-30-7 NSC_5311278
TypeSmall organic molecule
Emp. Form.C37H50N2O10
Mol. Mass.682.8003
SMILESCCN1CC2(COC(=O)c3ccccc3-n3c(O)cc(C)c3O)CCC(OC)C34C5CC6C(OC)C5C(O)(CC6OC)C(O)(C(OC)C23)C14