Reaction Details
TargetP2X purinoceptor 3
LigandBDBM86485
Substrate/Competitorn/a
Ki 10.4±n/a nM
CommentsPDSP_4069
Citation Jarvis, MFBianchi, BUchic, JTCartmell, JLee, CHWilliams, MFaltynek, C [3H]A-317491, a novel high-affinity non-nucleotide antagonist that specifically labels human P2X2/3 and P2X3 receptors. J Pharmacol Exp Ther310:407-16 (2004) 
 
P2X purinoceptor 3
Name:P2X purinoceptor 3
Type:Protein
Mol. Mass.:44292.02
Organism:Homo sapiens (Human)
Description:P56373
Residue:397
BDBM86485
NameBDBM86485
Synonyms:AP5A NSC_440210
TypeSmall organic molecule
Emp. Form.C20H29N10O22P5
Mol. Mass.916.3669
SMILESNc1ncnc2n(cnc12)C1OC(COP(O)(=O)OP(O)(=O)OP(O)(=O)OP(O)(=O)OP(O)(=O)OCC2OC(C(O)C2O)n2cnc3c(N)ncnc23)C(O)C1O