Reaction Details
TargetP2X purinoceptor 3
LigandBDBM86488
Substrate/Competitorn/a
Ki 7.7±n/a nM
CommentsPDSP_4060
Citation Jarvis, MFBianchi, BUchic, JTCartmell, JLee, CHWilliams, MFaltynek, C [3H]A-317491, a novel high-affinity non-nucleotide antagonist that specifically labels human P2X2/3 and P2X3 receptors. J Pharmacol Exp Ther310:407-16 (2004) 
 
P2X purinoceptor 3
Name:P2X purinoceptor 3
Type:Protein
Mol. Mass.:44292.02
Organism:Homo sapiens (Human)
Description:P56373
Residue:397
BDBM86488
NameBDBM86488
Synonyms:ATP, Bz NSC_0
TypeSmall organic molecule
Emp. Form.C24H24N5O15P3
Mol. Mass.715.3931
SMILESNc1ncnc2n(cnc12)[C@@H]1O[C@H](COP(O)(=O)OP(O)(=O)OP(O)(O)=O)[C@@H](OC(=O)c2ccc(cc2)C(=O)c2ccccc2)[C@H]1O