Reaction Details
TargetP2X purinoceptor 3
LigandBDBM50164644
Substrate/Competitorn/a
Ki 406±n/a nM
CommentsPDSP_4065
Citation Jarvis, MFBianchi, BUchic, JTCartmell, JLee, CHWilliams, MFaltynek, C [3H]A-317491, a novel high-affinity non-nucleotide antagonist that specifically labels human P2X2/3 and P2X3 receptors. J Pharmacol Exp Ther310:407-16 (2004) 
 
P2X purinoceptor 3
Name:P2X purinoceptor 3
Type:Protein
Mol. Mass.:44292.02
Organism:Homo sapiens (Human)
Description:P56373
Residue:397
BDBM50164644
NameBDBM50164644
Synonyms:2',3'-Dideoxyadenosine Triphosphate (Ddatp) ATP,2',3'-dideoxy [[[5-(6-amino-9H-purin-9-yl)tetrahydrofuran-2-yl]methoxy-hydroxy-phosphoryl]oxy-hydroxy-phosphoryl]oxyphosphonic acid ddATP
TypeSmall organic molecule
Emp. Form.C10H16N5O11P3
Mol. Mass.475.1822
SMILESNc1ncnc2n(cnc12)[C@H]1CC[C@@H](COP(O)(=O)OP(O)(=O)OP(O)(O)=O)O1