Reaction Details
TargetP2X purinoceptor 3
LigandBDBM85043
Substrate/Competitorn/a
Ki 3470±n/a nM
CommentsPDSP_3582
Citation Jarvis, MFBianchi, BUchic, JTCartmell, JLee, CHWilliams, MFaltynek, C [3H]A-317491, a novel high-affinity non-nucleotide antagonist that specifically labels human P2X2/3 and P2X3 receptors. J Pharmacol Exp Ther310:407-16 (2004) 
 
P2X purinoceptor 3
Name:P2X purinoceptor 3
Type:Protein
Mol. Mass.:44292.02
Organism:Homo sapiens (Human)
Description:P56373
Residue:397
BDBM85043
NameBDBM85043
Synonyms:CAS_149017-66-3 NSC_6093163 | PPADS
TypeSmall organic molecule
Emp. Form.C14H14N3O12PS2
Mol. Mass.511.378
SMILESCc1nc(N=Nc2ccc(cc2S(O)(=O)=O)S(O)(=O)=O)c(COP(O)(O)=O)c(C=O)c1O