Reaction Details
TargetP2X purinoceptor 2
LigandBDBM86487
Substrate/Competitorn/a
Ki 22.7±n/a nM
CommentsPDSP_4061
Citation Jarvis, MFBianchi, BUchic, JTCartmell, JLee, CHWilliams, MFaltynek, C [3H]A-317491, a novel high-affinity non-nucleotide antagonist that specifically labels human P2X2/3 and P2X3 receptors. J Pharmacol Exp Ther310:407-16 (2004) 
 
P2X purinoceptor 2
Name:P2X purinoceptor 2
Type:Enzyme Catalytic Domain
Mol. Mass.:51765.18
Organism:Homo sapiens (Human)
Description:PurinergicP2X2/3 0 HUMAN::Q9UBL9
Residue:471
BDBM86487
NameBDBM86487
Synonyms:ATP,3'-deoxy NSC_0
TypeSmall organic molecule
Emp. Form.C10H16N5O12P3
Mol. Mass.491.1816
SMILESNc1ncnc2n(cnc12)[C@@H]1O[C@H](COP(O)(=O)OP(O)(=O)OP(O)(O)=O)C[C@H]1O