Reaction Details
TargetBombesin receptor subtype-3
LigandBDBM86503
Substrate/Competitorn/a
Ki 2.3±n/a nM
CommentsPDSP_3746
Citation Mantey, SACoy, DHEntsuah, LKJensen, RT Development of bombesin analogs with conformationally restricted amino acid substitutions with enhanced selectivity for the orphan receptor human bombesin receptor subtype 3. J Pharmacol Exp Ther310:1161-70 (2004) 
 
Bombesin receptor subtype-3
Name:Bombesin receptor subtype-3
Type:Enzyme Catalytic Domain
Mol. Mass.:44424.45
Organism:Homo sapiens (Human)
Description:Bombesin 3 BRS3 HUMAN::P32247
Residue:399
BDBM86503
NameBDBM86503
Synonyms:CAS_0 [D-Tyr6,Beta-Dap11,Phe13,Nle14]Bn(6-14)
TypeSmall organic molecule
Emp. Form.C56H78N17O10
Mol. Mass.1149.3259
SMILESCCCC[C@H](NC(=O)[C@H](Cc1ccccc1)N[N+](=N)[C@H](Cc1cnc[nH]1)NC(=O)C(N)CNC(=O)[C@@H](NC(=O)[C@H](C)NC(=O)[C@H](Cc1c[nH]c2ccccc12)NC(=O)[C@H](CCC(N)=O)NC(=O)[C@H](N)Cc1ccc(O)cc1)C(C)C)C(N)=O