Reaction Details
TargetGamma-aminobutyric acid receptor subunit alpha-1
LigandBDBM50001765
Substrate/Competitorn/a
Ki 0.34±n/a nM
CommentsPDSP_1906
Citation Sullivan, SKPetroski, REVerge, GGross, RSFoster, ACGrigoriadis, DE Characterization of the interaction of indiplon, a novel pyrazolopyrimidine sedative-hypnotic, with the GABAA receptor. J Pharmacol Exp Ther311:537-46 (2004) 
 
Gamma-aminobutyric acid receptor subunit alpha-1
Name:Gamma-aminobutyric acid receptor subunit alpha-1
Type:Enzyme
Mol. Mass.:51770.21
Organism:Rattus norvegicus (Rat)
Description:P62813
Residue:455
BDBM50001765
NameBDBM50001765
Synonyms:8-chloro-6-(2-chlorophenyl)-1-methyl-4H-[1,2,4]triazolo[4,3-a][1,4]benzodiazepine Halcion | TRIAZOLAM
TypeSmall organic molecule
Emp. Form.C17H12Cl2N4
Mol. Mass.343.21
SMILESCc1nnc2CN=C(c3ccccc3Cl)c3cc(Cl)ccc3-n12