Reaction Details
Target5-hydroxytryptamine receptor 2A
LigandBDBM86523
Substrate/Competitorn/a
Ki 2.29±n/a nM
CommentsPDSP_1209
Citation Knight, ARMisra, AQuirk, KBenwell, KRevell, DKennett, GBickerdike, M Pharmacological characterisation of the agonist radioligand binding site of 5-HT(2A), 5-HT(2B) and 5-HT(2C) receptors. Naunyn Schmiedebergs Arch Pharmacol370:114-23 (2004) 
 
5-hydroxytryptamine receptor 2A
Name:5-hydroxytryptamine receptor 2A
Type:undefined
Mol. Mass.:52607.65
Organism:Homo sapiens (Human)
Description:P28223
Residue:471
BDBM86523
NameBDBM86523
Synonyms:CAS_17692-51-2 NSC_28693
TypeSmall organic molecule
Emp. Form.C25H29N3O2
Mol. Mass.403.5167
SMILESCN1CC(CNC(=O)OCc2ccccc2)CC2C1Cc1cn(C)c3cccc2c13