Reaction Details
Target5-hydroxytryptamine receptor 2B
LigandBDBM86523
Substrate/Competitorn/a
Ki 1.78±n/a nM
CommentsPDSP_1209
Citation Knight, ARMisra, AQuirk, KBenwell, KRevell, DKennett, GBickerdike, M Pharmacological characterisation of the agonist radioligand binding site of 5-HT(2A), 5-HT(2B) and 5-HT(2C) receptors. Naunyn Schmiedebergs Arch Pharmacol370:114-23 (2004) 
 
5-hydroxytryptamine receptor 2B
Name:5-hydroxytryptamine receptor 2B
Type:G Protein-Coupled Receptor (GPCR)
Mol. Mass.:54312.47
Organism:Homo sapiens (Human)
Description:Receptor binding assays were performed using human clone stably expressed in CHO cells.
Residue:481
BDBM86523
NameBDBM86523
Synonyms:CAS_17692-51-2 NSC_28693
TypeSmall organic molecule
Emp. Form.C25H29N3O2
Mol. Mass.403.5167
SMILESCN1CC(CNC(=O)OCc2ccccc2)CC2C1Cc1cn(C)c3cccc2c13