Reaction Details
Target5-hydroxytryptamine receptor 2B
LigandBDBM50014407
Substrate/Competitorn/a
Ki 85.11±n/a nM
CommentsPDSP_1578
Citation Knight, ARMisra, AQuirk, KBenwell, KRevell, DKennett, GBickerdike, M Pharmacological characterisation of the agonist radioligand binding site of 5-HT(2A), 5-HT(2B) and 5-HT(2C) receptors. Naunyn Schmiedebergs Arch Pharmacol370:114-23 (2004) 
 
5-hydroxytryptamine receptor 2B
Name:5-hydroxytryptamine receptor 2B
Type:G Protein-Coupled Receptor (GPCR)
Mol. Mass.:54312.47
Organism:Homo sapiens (Human)
Description:Receptor binding assays were performed using human clone stably expressed in CHO cells.
Residue:481
BDBM50014407
NameBDBM50014407
Synonyms:2-(piperazin-1-yl)quinoline 2-Piperazin-1-yl-quinoline (Quipazine) CHEMBL18772 | QUIPAZINE
TypeSmall organic molecule
Emp. Form.C13H15N3
Mol. Mass.213.2783
SMILESC1CN(CCN1)c1ccc2ccccc2n1