Reaction Details
Target5-hydroxytryptamine receptor 2B
LigandBDBM50060418
Substrate/Competitorn/a
Ki 2.45±n/a nM
CommentsPDSP_5211
Citation Knight, ARMisra, AQuirk, KBenwell, KRevell, DKennett, GBickerdike, M Pharmacological characterisation of the agonist radioligand binding site of 5-HT(2A), 5-HT(2B) and 5-HT(2C) receptors. Naunyn Schmiedebergs Arch Pharmacol370:114-23 (2004) 
 
5-hydroxytryptamine receptor 2B
Name:5-hydroxytryptamine receptor 2B
Type:G Protein-Coupled Receptor (GPCR)
Mol. Mass.:54312.47
Organism:Homo sapiens (Human)
Description:Receptor binding assays were performed using human clone stably expressed in CHO cells.
Residue:481
BDBM50060418
NameBDBM50060418
Synonyms:5-Methylsulfanyl-6-trifluoromethyl-2,3-dihydro-indole-1-carboxylic acid pyridin-3-ylamide SB 221284
TypeSmall organic molecule
Emp. Form.C16H14F3N3OS
Mol. Mass.353.362
SMILESCSc1cc2CCN(C(=O)Nc3cccnc3)c2cc1C(F)(F)F