Reaction Details
Target5-hydroxytryptamine receptor 2C
LigandBDBM86529
Substrate/Competitorn/a
Ki 1.91±n/a nM
CommentsPDSP_797
Citation Knight, ARMisra, AQuirk, KBenwell, KRevell, DKennett, GBickerdike, M Pharmacological characterisation of the agonist radioligand binding site of 5-HT(2A), 5-HT(2B) and 5-HT(2C) receptors. Naunyn Schmiedebergs Arch Pharmacol370:114-23 (2004) 
 
5-hydroxytryptamine receptor 2C
Name:5-hydroxytryptamine receptor 2C
Type:G Protein-Coupled Receptor (GPCR)
Mol. Mass.:51836.79
Organism:Homo sapiens (Human)
Description:P28335
Residue:458
BDBM86529
NameBDBM86529
Synonyms:CAS_113-15-5 NSC_3251
TypeSmall organic molecule
Emp. Form.C33H35N5O5
Mol. Mass.581.6615
SMILESCN1CC(C=C2C1Cc1c[nH]c3cccc2c13)C(=O)NC1(C)OC2(O)C3CCCN3C(=O)C(Cc3ccccc3)N2C1=O