Reaction Details
Target5-hydroxytryptamine receptor 2C
LigandBDBM86526
Substrate/Competitorn/a
Ki 7.59±n/a nM
CommentsPDSP_1421
Citation Knight, ARMisra, AQuirk, KBenwell, KRevell, DKennett, GBickerdike, M Pharmacological characterisation of the agonist radioligand binding site of 5-HT(2A), 5-HT(2B) and 5-HT(2C) receptors. Naunyn Schmiedebergs Arch Pharmacol370:114-23 (2004) 
 
5-hydroxytryptamine receptor 2C
Name:5-hydroxytryptamine receptor 2C
Type:G Protein-Coupled Receptor (GPCR)
Mol. Mass.:51836.79
Organism:Homo sapiens (Human)
Description:P28335
Residue:458
BDBM86526
NameBDBM86526
Synonyms:ORG-37684
TypeSmall organic molecule
Emp. Form.C14H19NO2
Mol. Mass.233.3062
SMILESCOc1ccc2CCCc2c1O[C@H]1CCNC1