Reaction Details
Target5-hydroxytryptamine receptor 2C
LigandBDBM85528
Substrate/Competitorn/a
Ki 6.03±n/a nM
CommentsPDSP_1608
Citation Knight, ARMisra, AQuirk, KBenwell, KRevell, DKennett, GBickerdike, M Pharmacological characterisation of the agonist radioligand binding site of 5-HT(2A), 5-HT(2B) and 5-HT(2C) receptors. Naunyn Schmiedebergs Arch Pharmacol370:114-23 (2004) 
 
5-hydroxytryptamine receptor 2C
Name:5-hydroxytryptamine receptor 2C
Type:G Protein-Coupled Receptor (GPCR)
Mol. Mass.:51836.79
Organism:Homo sapiens (Human)
Description:P28335
Residue:458
BDBM85528
NameBDBM85528
Synonyms:CAS_3045226 Ro 60-0175
TypeSmall organic molecule
Emp. Form.C11H12ClFN2
Mol. Mass.226.678
SMILESCC(N)Cn1ccc2cc(F)c(Cl)cc12