Reaction Details
Target5-hydroxytryptamine receptor 2C
LigandBDBM85099
Substrate/Competitorn/a
Ki 7.59±n/a nM
CommentsPDSP_5212
Citation Knight, ARMisra, AQuirk, KBenwell, KRevell, DKennett, GBickerdike, M Pharmacological characterisation of the agonist radioligand binding site of 5-HT(2A), 5-HT(2B) and 5-HT(2C) receptors. Naunyn Schmiedebergs Arch Pharmacol370:114-23 (2004) 
 
5-hydroxytryptamine receptor 2C
Name:5-hydroxytryptamine receptor 2C
Type:G Protein-Coupled Receptor (GPCR)
Mol. Mass.:51836.79
Organism:Homo sapiens (Human)
Description:P28335
Residue:458
BDBM85099
NameBDBM85099
Synonyms:CAS_141474-54-6 SDZ SER-082 | SER-082
TypeSmall organic molecule
Emp. Form.C15H20N2
Mol. Mass.228.3327
SMILESCN1CC[C@@H]2CN3CCc4cccc([C@@H]2C1)c34