Reaction Details
Target5-hydroxytryptamine receptor 2C
LigandBDBM84742
Substrate/Competitorn/a
Ki>10000±n/a nM
CommentsPDSP_5207
Citation Knight, ARMisra, AQuirk, KBenwell, KRevell, DKennett, GBickerdike, M Pharmacological characterisation of the agonist radioligand binding site of 5-HT(2A), 5-HT(2B) and 5-HT(2C) receptors. Naunyn Schmiedebergs Arch Pharmacol370:114-23 (2004) 
 
5-hydroxytryptamine receptor 2C
Name:5-hydroxytryptamine receptor 2C
Type:G Protein-Coupled Receptor (GPCR)
Mol. Mass.:51836.79
Organism:Homo sapiens (Human)
Description:P28335
Residue:458
BDBM84742
NameBDBM84742
Synonyms:CAS_106650-56-0 sibutramine
TypeSmall organic molecule
Emp. Form.C17H26ClN
Mol. Mass.279.848
SMILESCC(C)CC(N(C)C)C1(CCC1)c1ccc(Cl)cc1