Reaction Details
TargetSodium-dependent serotonin transporter
LigandBDBM86541
Substrate/Competitorn/a
Ki>10000±n/a nM
CommentsPDSP_4174
Citation Appendino, GDe Petrocellis, LTrevisani, MMinassi, ADaddario, NMoriello, ASGazzieri, DLigresti, ACampi, BFontana, GPinna, CGeppetti, PDi Marzo, V Development of the first ultra-potent "capsaicinoid" agonist at transient receptor potential vanilloid type 1 (TRPV1) channels and its therapeutic potential. J Pharmacol Exp Ther312:561-70 (2005) 
 
Sodium-dependent serotonin transporter
Name:Sodium-dependent serotonin transporter
Type:Multi-pass membrane protein
Mol. Mass.:70168.43
Organism:Rattus norvegicus (rat)
Description:P31652
Residue:630
BDBM86541
NameBDBM86541
Synonyms:Rinvanil, Acetyl
TypeSmall organic molecule
Emp. Form.C28H45NO5
Mol. Mass.475.6606
SMILESCCCCCC[C@H](CC=CCCCCCCCC(=O)NCc1ccc(O)c(OC)c1)OC(C)=O