Reaction Details
TargetCannabinoid receptor 2
LigandBDBM86540
Substrate/Competitorn/a
Ki 1500±n/a nM
CommentsPDSP_4182
Citation Appendino, GDe Petrocellis, LTrevisani, MMinassi, ADaddario, NMoriello, ASGazzieri, DLigresti, ACampi, BFontana, GPinna, CGeppetti, PDi Marzo, V Development of the first ultra-potent "capsaicinoid" agonist at transient receptor potential vanilloid type 1 (TRPV1) channels and its therapeutic potential. J Pharmacol Exp Ther312:561-70 (2005) 
 
Cannabinoid receptor 2
Name:Cannabinoid receptor 2
Type:G Protein-Coupled Receptor (GPCR)
Mol. Mass.:39690.94
Organism:Homo sapiens (Human)
Description:P34972
Residue:360
BDBM86540
NameBDBM86540
Synonyms:PhAR, 5-I
TypeSmall organic molecule
Emp. Form.C34H48INO5
Mol. Mass.677.6531
SMILESCCCCCC[C@H](CC=CCCCCCCCC(=O)NCc1cc(I)c(O)c(OC)c1)OC(=O)Cc1ccccc1