Reaction Details
TargetCannabinoid receptor 2
LigandBDBM86535
Substrate/Competitorn/a
Ki 2200±n/a nM
CommentsPDSP_4181
Citation Appendino, GDe Petrocellis, LTrevisani, MMinassi, ADaddario, NMoriello, ASGazzieri, DLigresti, ACampi, BFontana, GPinna, CGeppetti, PDi Marzo, V Development of the first ultra-potent "capsaicinoid" agonist at transient receptor potential vanilloid type 1 (TRPV1) channels and its therapeutic potential. J Pharmacol Exp Ther312:561-70 (2005) 
 
Cannabinoid receptor 2
Name:Cannabinoid receptor 2
Type:G Protein-Coupled Receptor (GPCR)
Mol. Mass.:39690.94
Organism:Homo sapiens (Human)
Description:P34972
Residue:360
BDBM86535
NameBDBM86535
Synonyms:PhAR, 6-I
TypeSmall organic molecule
Emp. Form.C34H48INO5
Mol. Mass.677.6531
SMILESCCCCCC[C@H](CC=CCCCCCCCC(=O)NCc1cc(OC)c(O)cc1I)OC(=O)Cc1ccccc1