Reaction Details
TargetCannabinoid receptor 2
LigandBDBM86541
Substrate/Competitorn/a
Ki>10000±n/a nM
CommentsPDSP_4174
Citation Appendino, GDe Petrocellis, LTrevisani, MMinassi, ADaddario, NMoriello, ASGazzieri, DLigresti, ACampi, BFontana, GPinna, CGeppetti, PDi Marzo, V Development of the first ultra-potent "capsaicinoid" agonist at transient receptor potential vanilloid type 1 (TRPV1) channels and its therapeutic potential. J Pharmacol Exp Ther312:561-70 (2005) 
 
Cannabinoid receptor 2
Name:Cannabinoid receptor 2
Type:G Protein-Coupled Receptor (GPCR)
Mol. Mass.:39690.94
Organism:Homo sapiens (Human)
Description:P34972
Residue:360
BDBM86541
NameBDBM86541
Synonyms:Rinvanil, Acetyl
TypeSmall organic molecule
Emp. Form.C28H45NO5
Mol. Mass.475.6606
SMILESCCCCCC[C@H](CC=CCCCCCCCC(=O)NCc1ccc(O)c(OC)c1)OC(C)=O