Reaction Details
TargetNeuronal acetylcholine receptor subunit alpha-4
LigandBDBM86311
Substrate/Competitorn/a
Ki 0.2±n/a nM
CommentsPDSP_609
Citation Grinevich, VPLetchworth, SRLindenberger, KAMenager, JMary, VSadieva, KABuhlman, LMBohme, GAPradier, LBenavides, JLukas, RJBencherif, M Heterologous expression of human {alpha}6{beta}4{beta}3{alpha}5 nicotinic acetylcholine receptors: binding properties consistent with their natural expression require quaternary subunit assembly including the {alpha}5 subunit. J Pharmacol Exp Ther312:619-26 (2005) 
 
Neuronal acetylcholine receptor subunit alpha-4
Name:Neuronal acetylcholine receptor subunit alpha-4
Type:Enzyme
Mol. Mass.:70196.44
Organism:Rattus norvegicus (Rat)
Description:P09483
Residue:630
BDBM86311
NameBDBM86311
Synonyms:CAS_485-35-8 Cytisine-(-) US11667638, Example Cytisine
TypeSmall organic molecule
Emp. Form.C11H14N2O
Mol. Mass.190.2417
SMILESO=c1cccc2C3CNCC(C3)Cn12