Reaction Details
TargetNeuronal acetylcholine receptor subunit alpha-5
LigandBDBM50004656
Substrate/Competitorn/a
Ki 3250±n/a nM
CommentsPDSP_467
Citation Grinevich, VPLetchworth, SRLindenberger, KAMenager, JMary, VSadieva, KABuhlman, LMBohme, GAPradier, LBenavides, JLukas, RJBencherif, M Heterologous expression of human {alpha}6{beta}4{beta}3{alpha}5 nicotinic acetylcholine receptors: binding properties consistent with their natural expression require quaternary subunit assembly including the {alpha}5 subunit. J Pharmacol Exp Ther312:619-26 (2005) 
 
Neuronal acetylcholine receptor subunit alpha-5
Name:Neuronal acetylcholine receptor subunit alpha-5
Type:Enzyme Catalytic Domain
Mol. Mass.:51875.01
Organism:RAT
Description:Cholinergic, Nicotinic Alpha6Beta3Beta4Alpha5 0 RAT::P20420
Residue:452
BDBM50004656
NameBDBM50004656
Synonyms:(2-Carbamoyloxy-ethyl)-trimethyl-ammonium (2-Hydroxyethyl)trimethyl ammonium chloride carbamate (carbachol)(2-Carbamoyloxy-ethyl)-trimethyl-ammonium 2-((Aminocarbonyl)oxy)-N,N,N-trimethylethanaminum chloride 2-(carbamoyloxy)-N,N,N-trimethylethanaminium chloride CARBASTAT Carbachol chloride Choline carbamate chloride Choline chlorine carbamate Karbamoylcholin chlorid | MIOSTAT
TypeSmall organic molecule
Emp. Form.C6H15N2O2
Mol. Mass.147.195
SMILESC[N+](C)(C)CCOC(N)=O