Reaction Details
TargetNeuronal acetylcholine receptor subunit alpha-5
LigandBDBM86241
Substrate/Competitorn/a
Ki>10000±n/a nM
CommentsPDSP_666
Citation Grinevich, VPLetchworth, SRLindenberger, KAMenager, JMary, VSadieva, KABuhlman, LMBohme, GAPradier, LBenavides, JLukas, RJBencherif, M Heterologous expression of human {alpha}6{beta}4{beta}3{alpha}5 nicotinic acetylcholine receptors: binding properties consistent with their natural expression require quaternary subunit assembly including the {alpha}5 subunit. J Pharmacol Exp Ther312:619-26 (2005) 
 
Neuronal acetylcholine receptor subunit alpha-5
Name:Neuronal acetylcholine receptor subunit alpha-5
Type:Enzyme Catalytic Domain
Mol. Mass.:51875.01
Organism:RAT
Description:Cholinergic, Nicotinic Alpha6Beta3Beta4Alpha5 0 RAT::P20420
Residue:452
BDBM86241
NameBDBM86241
Synonyms:CAS_23255-54-1 NSC_31762
TypeSmall organic molecule
Emp. Form.C16H21NO3
Mol. Mass.275.3428
SMILESCOC1CC=C2CCN3CCC4=C(CC(=O)OC4)C23C1