Reaction Details
TargetMitogen-activated protein kinase 8
LigandBDBM86637
Substrate/Competitorn/a
Meas. Tech.JNK Kinase Assay
IC50 13±0.0 nM
Citation Zhang, TInesta-Vaquera, FNiepel, MZhang, JFicarro, SBMachleidt, TXie, TMarto, JAKim, NSim, TLaughlin, JDPark, HLoGrasso, PVPatricelli, MNomanbhoy, TKSorger, PKAlessi, DRGray, NS Discovery of potent and selective covalent inhibitors of JNK. Chem Biol19:140-54 (2012) 
 
Mitogen-activated protein kinase 8
Name:Mitogen-activated protein kinase 8
Type:Enzyme
Mol. Mass.:48297.57
Organism:Homo sapiens (Human)
Description:JNK-1 was purchased from Upstate Cell Signaling Solutions (formerly Upstate Biotechnology).
Residue:427
BDBM86637
NameBDBM86637
Synonyms:JNK-IN-12
TypeSmall organic molecule
Emp. Form.C32H28N8O2S
Mol. Mass.588.682
SMILESCN(C)C\C=C\C(=O)Nc1cccc(c1)C(=O)Nc1ccc(Nc2nccc(n2)C(C#N)c2nc3ccccc3s2)cc1