Reaction Details
TargetMitogen-activated protein kinase 10
LigandBDBM86633
Substrate/Competitorn/a
Meas. Tech.JNK Kinase Assay
IC50 0.98±0.0 nM
Citation Zhang, TInesta-Vaquera, FNiepel, MZhang, JFicarro, SBMachleidt, TXie, TMarto, JAKim, NSim, TLaughlin, JDPark, HLoGrasso, PVPatricelli, MNomanbhoy, TKSorger, PKAlessi, DRGray, NS Discovery of potent and selective covalent inhibitors of JNK. Chem Biol19:140-54 (2012) 
 
Mitogen-activated protein kinase 10
Name:Mitogen-activated protein kinase 10
Type:Enzyme
Mol. Mass.:52586.89
Organism:Homo sapiens (Human)
Description:n/a
Residue:464
BDBM86633
NameBDBM86633
Synonyms:JNK-IN-8
TypeSmall organic molecule
Emp. Form.C29H29N7O2
Mol. Mass.507.5863
SMILESCN(C)C\C=C\C(=O)Nc1cccc(c1)C(=O)Nc1ccc(Nc2nccc(n2)-c2cccnc2)c(C)c1