Reaction Details
TargetMitogen-activated protein kinase 10
LigandBDBM16018
Substrate/Competitorn/a
Meas. Tech.JNK Kinase Assay
IC50 190±0.0 nM
Citation Zhang, TInesta-Vaquera, FNiepel, MZhang, JFicarro, SBMachleidt, TXie, TMarto, JAKim, NSim, TLaughlin, JDPark, HLoGrasso, PVPatricelli, MNomanbhoy, TKSorger, PKAlessi, DRGray, NS Discovery of potent and selective covalent inhibitors of JNK. Chem Biol19:140-54 (2012) 
 
Mitogen-activated protein kinase 10
Name:Mitogen-activated protein kinase 10
Type:Enzyme
Mol. Mass.:52586.89
Organism:Homo sapiens (Human)
Description:n/a
Residue:464
BDBM16018
NameBDBM16018
Synonyms:14,15-diazatetracyclo[7.6.1.0^{2,7}.0^{13,16}]hexadeca-1(15),2(7),3,5,9(16),10,12-heptaen-8-one ChemBiol10705 Compound 4 SP 600125 SP600125 dibenzo[cd,g]indazol-6(2H)-one
TypeSmall organic molecule
Emp. Form.C14H8N2O
Mol. Mass.220.2261
SMILESO=C1c2ccccc2-c2n[nH]c3cccc1c23