Reaction Details
TargetDual 3',5'-cyclic-AMP and -GMP phosphodiesterase 11A
LigandBDBM86642
Substrate/Competitorn/a
Meas. Tech.In Vitro Enzyme Assay
IC50 2.8e+2±n/a nM
Citation Ceyhan, OBirsoy, KHoffman, CS Identification of biologically active PDE11-selective inhibitors using a yeast-based high-throughput screen. Chem Biol19:155-63 (2012) 
 
Dual 3',5'-cyclic-AMP and -GMP phosphodiesterase 11A
Name:Dual 3',5'-cyclic-AMP and -GMP phosphodiesterase 11A
Type:Enzyme
Mol. Mass.:104751.53
Organism:Homo sapiens (Human)
Description:Q9HCR9
Residue:933
BDBM86642
NameBDBM86642
Synonyms:BC11-38 | US9173884, BC11-38
TypeSmall organic molecule
Emp. Form.C15H16N2OS2
Mol. Mass.304.43
SMILESCCCSc1nc2CCSc2c(=O)n1-c1ccccc1