Reaction Details
TargetGlucocorticoid receptor
LigandBDBM86696
Substrate/Competitorn/a
Ki 0.31±n/a nM
CommentsPDSP_5776
Citation Belvisi, MGBundschuh, DSStoeck, MWicks, SUnderwood, SBattram, CHHaddad, el-BWebber, SEFoster, ML Preclinical profile of ciclesonide, a novel corticosteroid for the treatment of asthma. J Pharmacol Exp Ther314:568-74 (2005) 
 
Glucocorticoid receptor
Name:Glucocorticoid receptor
Type:Enzyme
Mol. Mass.:85656.87
Organism:Homo sapiens (Human)
Description:P04150
Residue:777
BDBM86696
NameBDBM86696
Synonyms:des-CIC | desisobutyryl-ciclesonide
TypeSmall organic molecule
Emp. Form.C28H38O6
Mol. Mass.470.5977
SMILESC[C@]12C[C@H](O)[C@H]3[C@@H](CCC4=CC(=O)C=C[C@]34C)[C@@H]1C[C@H]1O[C@H](O[C@@]21C(=O)CO)C1CCCCC1