Reaction Details
Target5-hydroxytryptamine receptor 1A
LigandBDBM50004327
Substrate/Competitorn/a
Ki 3416±n/a nM
CommentsPDSP_1177
Citation Pehek, EANocjar, CRoth, BLByrd, TAMabrouk, OS Evidence for the preferential involvement of 5-HT2A serotonin receptors in stress- and drug-induced dopamine release in the rat medial prefrontal cortex. Neuropsychopharmacology31:265-77 (2006) 
 
5-hydroxytryptamine receptor 1A
Name:5-hydroxytryptamine receptor 1A
Type:n/a
Mol. Mass.:46122.49
Organism:Homo sapiens (Human)
Description:n/a
Residue:422
BDBM50004327
NameBDBM50004327
Synonyms:(1-Phenethyl-piperidin-4-yl)-phenyl-methanol Glemanserin MDL-11939
TypeSmall organic molecule
Emp. Form.C20H25NO
Mol. Mass.295.4186
SMILESOC(C1CCN(CCc2ccccc2)CC1)c1ccccc1