Reaction Details
Target5-hydroxytryptamine receptor 2B
LigandBDBM50004327
Substrate/Competitorn/a
Ki 1419±n/a nM
CommentsPDSP_1177
Citation Pehek, EANocjar, CRoth, BLByrd, TAMabrouk, OS Evidence for the preferential involvement of 5-HT2A serotonin receptors in stress- and drug-induced dopamine release in the rat medial prefrontal cortex. Neuropsychopharmacology31:265-77 (2006) 
 
5-hydroxytryptamine receptor 2B
Name:5-hydroxytryptamine receptor 2B
Type:G Protein-Coupled Receptor (GPCR)
Mol. Mass.:54312.47
Organism:Homo sapiens (Human)
Description:Receptor binding assays were performed using human clone stably expressed in CHO cells.
Residue:481
BDBM50004327
NameBDBM50004327
Synonyms:(1-Phenethyl-piperidin-4-yl)-phenyl-methanol Glemanserin MDL-11939
TypeSmall organic molecule
Emp. Form.C20H25NO
Mol. Mass.295.4186
SMILESOC(C1CCN(CCc2ccccc2)CC1)c1ccccc1