Reaction Details
TargetSodium-dependent noradrenaline transporter
LigandBDBM50232153
Substrate/Competitorn/a
Ki>10000±n/a nM
CommentsPDSP_1172
Citation Pehek, EANocjar, CRoth, BLByrd, TAMabrouk, OS Evidence for the preferential involvement of 5-HT2A serotonin receptors in stress- and drug-induced dopamine release in the rat medial prefrontal cortex. Neuropsychopharmacology31:265-77 (2006) 
 
Sodium-dependent noradrenaline transporter
Name:Sodium-dependent noradrenaline transporter
Type:Multi-pass membrane protein
Mol. Mass.:69337.72
Organism:Homo sapiens (Human)
Description:P23975
Residue:617
BDBM50232153
NameBDBM50232153
Synonyms:(1-(4-fluorophenethyl)piperidin-4-yl)(2,3-dimethoxyphenyl)methanol CHEMBL257283 MDL-100907
TypeSmall organic molecule
Emp. Form.C22H28FNO3
Mol. Mass.373.461
SMILESCOc1cccc(C(O)C2CCN(CCc3ccc(F)cc3)CC2)c1OC