Reaction Details
TargetGlycerophosphocholine phosphodiesterase GPCPD1
LigandBDBM14777
Substrate/Competitorn/a
Ki 9.77±n/a nM
CommentsPDSP_6938
Citation Teixeira, CEPriviero, FBWebb, RC Differential effects of the phosphodiesterase type 5 inhibitors sildenafil, vardenafil, and tadalafil in rat aorta. J Pharmacol Exp Ther316:654-61 (2006) 
 
Glycerophosphocholine phosphodiesterase GPCPD1
Name:Glycerophosphocholine phosphodiesterase GPCPD1
Type:Enzyme Catalytic Domain
Mol. Mass.:76256.67
Organism:RAT
Description:Phosphodiesterase 5 0 RAT::Q80VJ4
Residue:672
BDBM14777
NameBDBM14777
Synonyms:(2R,8R)-2-(2H-1,3-benzodioxol-5-yl)-6-methyl-3,6,17-triazatetracyclo[8.7.0.0^{3,8}.0^{11,16}]heptadeca-1(10),11(16),12,14-tetraene-4,7-dione CHEMBL779 GF 196960 | Tadalafil
TypeSmall organic molecule
Emp. Form.C22H19N3O4
Mol. Mass.389.404
SMILES[H][C@]12Cc3c([nH]c4ccccc34)[C@H](N1C(=O)CN(C)C2=O)c1ccc2OCOc2c1