Reaction Details
TargetcAMP-dependent protein kinase catalytic subunit beta
LigandBDBM14027
Substrate/Competitorn/a
Ki 1600±n/a nM
CommentsPDSP_6133
Citation Braverman, ASTibb, ASRuggieri, MR M2 and M3 muscarinic receptor activation of urinary bladder contractile signal transduction. I. Normal rat bladder. J Pharmacol Exp Ther316:869-74 (2006) 
 
cAMP-dependent protein kinase catalytic subunit beta
Name:cAMP-dependent protein kinase catalytic subunit beta
Type:Enzyme Catalytic Domain
Mol. Mass.:40715.41
Organism:RAT
Description:PKA 0 RAT::P68182
Residue:351
BDBM14027
NameBDBM14027
Synonyms:5-(1,4-diazepan-1-ylsulfonyl)isoquinoline AT877 CHEMBL541388 HA-1077 cid_163751
TypeSmall organic molecule
Emp. Form.C14H17N3O2S
Mol. Mass.291.369
SMILESO=S(=O)(N1CCCNCC1)c1cccc2cnccc12