Reaction Details
TargetProtein kinase C alpha type
LigandBDBM86729
Substrate/Competitorn/a
Ki>10000±n/a nM
CommentsPDSP_6132
Citation Braverman, ASTibb, ASRuggieri, MR M2 and M3 muscarinic receptor activation of urinary bladder contractile signal transduction. I. Normal rat bladder. J Pharmacol Exp Ther316:869-74 (2006) 
 
Protein kinase C alpha type
Name:Protein kinase C alpha type
Type:Protein
Mol. Mass.:76797.67
Organism:Rattus norvegicus (Rat)
Description:P05696
Residue:672
BDBM86729
NameBDBM86729
Synonyms:(R)-(+)-trans-4-(1-aminoethyl)-N-(4-pyridyl)cyclohexanecarboxamide dihydrochloride Y-27632
TypeSmall organic molecule
Emp. Form.C14H21N3O
Mol. Mass.247.336
SMILESC[C@@H](N)[C@H]1CC[C@@H](CC1)C(=O)Nc1ccncc1