Reaction Details
TargetAlpha-1B adrenergic receptor
LigandBDBM50033110
Substrate/Competitorn/a
Ki 10±n/a nM
CommentsPDSP_6217
Citation Kinsella, GKRozas, IWatson, GW Computational study of antagonist/alpha1A adrenoceptor complexes--observations of conformational variations on the formation of ligand/receptor complexes. J Med Chem49:501-10 (2006) 
 
Alpha-1B adrenergic receptor
Name:Alpha-1B adrenergic receptor
Type:Enzyme Catalytic Domain
Mol. Mass.:50983.17
Organism:Mus musculus
Description:Q05D47
Residue:462
BDBM50033110
NameBDBM50033110
Synonyms:ALFUZOSIN N-{3-[(4-amino-6,7-dimethoxyquinazolin-2-yl)(methyl)amino]propyl}tetrahydrofuran-2-carboxamide
TypeSmall organic molecule
Emp. Form.C19H27N5O4
Mol. Mass.389.4488
SMILESCOc1cc2nc(nc(N)c2cc1OC)N(C)CCCNC(=O)C1CCCO1