Reaction Details
TargetAlpha-1B adrenergic receptor
LigandBDBM50160165
Substrate/Competitorn/a
Ki 16±n/a nM
CommentsPDSP_6219
Citation Kinsella, GKRozas, IWatson, GW Computational study of antagonist/alpha1A adrenoceptor complexes--observations of conformational variations on the formation of ligand/receptor complexes. J Med Chem49:501-10 (2006) 
 
Alpha-1B adrenergic receptor
Name:Alpha-1B adrenergic receptor
Type:Enzyme Catalytic Domain
Mol. Mass.:50983.17
Organism:Mus musculus
Description:Q05D47
Residue:462
BDBM50160165
NameBDBM50160165
Synonyms:CHEMBL88272 [2-(2-Cyclopropylmethoxy-phenoxy)-ethyl]-[2-(1H-indol-3-yl)-1,1-dimethyl-ethyl]-amine | [2-(5-Chloro-1H-indol-3-yl)-1,1-dimethyl-ethyl]-[2-(2-cyclopropylmethoxy-phenoxy)-ethyl]-amine
TypeSmall organic molecule
Emp. Form.C24H29ClN2O2
Mol. Mass.412.952
SMILESCC(C)(Cc1c[nH]c2ccc(Cl)cc12)NCCOc1ccccc1OCC1CC1