Reaction Details
TargetAlpha-1B adrenergic receptor
LigandBDBM50033111
Substrate/Competitorn/a
Ki 2±n/a nM
CommentsPDSP_1798
Citation Kinsella, GKRozas, IWatson, GW Computational study of antagonist/alpha1A adrenoceptor complexes--observations of conformational variations on the formation of ligand/receptor complexes. J Med Chem49:501-10 (2006) 
 
Alpha-1B adrenergic receptor
Name:Alpha-1B adrenergic receptor
Type:Enzyme Catalytic Domain
Mol. Mass.:50983.17
Organism:Mus musculus
Description:Q05D47
Residue:462
BDBM50033111
NameBDBM50033111
Synonyms:1-(4-Amino-6,7-dimethoxy-2-quinazolinyl)-4-((tetrahydro-2-furanyl)carbonyl)piperazine CHEMBL611 Terazosine
TypeSmall organic molecule
Emp. Form.C19H25N5O4
Mol. Mass.387.4329
SMILESCOc1cc2nc(nc(N)c2cc1OC)N1CCN(CC1)C(=O)C1CCCO1