Reaction Details
TargetAlpha-1B adrenergic receptor
LigandBDBM81444
Substrate/Competitorn/a
Ki 2.5±n/a nM
CommentsPDSP_1955
Citation Kinsella, GKRozas, IWatson, GW Computational study of antagonist/alpha1A adrenoceptor complexes--observations of conformational variations on the formation of ligand/receptor complexes. J Med Chem49:501-10 (2006) 
 
Alpha-1B adrenergic receptor
Name:Alpha-1B adrenergic receptor
Type:Enzyme Catalytic Domain
Mol. Mass.:50983.17
Organism:Mus musculus
Description:Q05D47
Residue:462
BDBM81444
NameBDBM81444
Synonyms:CAS_185453 WB 4101 | WB-4101
TypeSmall organic molecule
Emp. Form.C25H27NO5
Mol. Mass.421.4856
SMILESCOc1cccc(OC)c1OCCNCC1Oc2ccccc2OC1c1ccccc1