Reaction Details
TargetAlpha-1A adrenergic receptor
LigandBDBM86731
Substrate/Competitorn/a
Ki 4±n/a nM
CommentsPDSP_6216
Citation Kinsella, GKRozas, IWatson, GW Computational study of antagonist/alpha1A adrenoceptor complexes--observations of conformational variations on the formation of ligand/receptor complexes. J Med Chem49:501-10 (2006) 
 
Alpha-1A adrenergic receptor
Name:Alpha-1A adrenergic receptor
Type:Cell-surface receptors
Mol. Mass.:51511.67
Organism:Homo sapiens (Human)
Description:P35348
Residue:466
BDBM86731
NameBDBM86731
Synonyms:CAS_74191-85-8 UK 33,274
TypeSmall organic molecule
Emp. Form.C23H25N5O5
Mol. Mass.451.4751
SMILESCOc1cc2nc(nc(N)c2cc1OC)N1CCN(CC1)C(=O)C1COc2ccccc2O1