Reaction Details
TargetHistamine H2 receptor
LigandBDBM86744
Substrate/Competitorn/a
Ki 23±n/a nM
CommentsPDSP_6452
Citation Xie, SXKraus, AGhorai, PYe, QZElz, SBuschauer, ASeifert, R N1-(3-cyclohexylbutanoyl)-N2-[3-(1H-imidazol-4-yl)propyl]guanidine (UR-AK57), a potent partial agonist for the human histamine H1- and H2-receptors. J Pharmacol Exp Ther317:1262-8 (2006) 
 
Histamine H2 receptor
Name:Histamine H2 receptor
Type:G Protein-Coupled Receptor (GPCR)
Mol. Mass.:40567.22
Organism:Cavia porcellus (domestic guinea pig)
Description:For the H2 receptor-binding assays, guinea pig striatum was used.
Residue:359
BDBM86744
NameBDBM86744
Synonyms:UR-AK62
TypeSmall organic molecule
Emp. Form.C15H25N5O
Mol. Mass.291.3919
SMILESNC(NC(=O)CC1CCCCC1)=NCCCc1cnc[nH]1