Reaction Details
TargetD(1A) dopamine receptor
LigandBDBM86708
Substrate/Competitorn/a
Ki>10000±n/a nM
CommentsPDSP_1954
Citation Chemel, BRRoth, BLArmbruster, BWatts, VJNichols, DE WAY-100635 is a potent dopamine D4 receptor agonist. Psychopharmacology (Berl)188:244-51 (2006) 
 
D(1A) dopamine receptor
Name:D(1A) dopamine receptor
Type:Enzyme
Mol. Mass.:49303.43
Organism:Homo sapiens (Human)
Description:P21728
Residue:446
BDBM86708
NameBDBM86708
Synonyms:CAS_146714-97-8 CHEMBL514874 NSC_104911 | WAY 100,635
TypeSmall organic molecule
Emp. Form.C25H34N4O2
Mol. Mass.422.5631
SMILESCOc1ccccc1N1CCN(CCN(C(=O)C2CCCCC2)c2ccccn2)CC1