Reaction Details
Target5-hydroxytryptamine receptor 7
LigandBDBM86757
Substrate/Competitorn/a
Ki 12.9±n/a nM
CommentsPDSP_7627
Citation Kumar, JSPrabhakaran, JMajo, VJMilak, MSHsiung, SCTamir, HSimpson, NRVan Heertum, RLMann, JJParsey, RV Synthesis and in vivo evaluation of a novel 5-HT1A receptor agonist radioligand [O-methyl- 11C]2-(4-(4-(2-methoxyphenyl)piperazin-1-yl)butyl)-4-methyl-1,2,4-triazine-3,5(2H,4H)dione in nonhuman primates. Eur J Nucl Med Mol Imaging34:1050-60 (2007) 
 
5-hydroxytryptamine receptor 7
Name:5-hydroxytryptamine receptor 7
Type:Enzyme Catalytic Domain
Mol. Mass.:47690.33
Organism:BOVINE
Description:L8II28
Residue:428
BDBM86757
NameBDBM86757
Synonyms:CAS_0 [11C]MMP
TypeSmall organic molecule
Emp. Form.C19H27N5O3
Mol. Mass.373.4494
SMILESCOc1ccccc1N1CCN(CCCCn2ncc(=O)n(C)c2=O)CC1