Reaction Details
TargetAcetylcholinesterase
LigandBDBM8961
Substrate/CompetitorBDBM8959
Meas. Tech.Enzyme Assay
IC50 5.46±n/a nM
Citation Szymanski, PMarkowicz, MMikiciuk-Olasik, E Synthesis and biological activity of derivatives of tetrahydroacridine as acetylcholinesterase inhibitors. Bioorg Chem39:138-42 (2011) 
 
Acetylcholinesterase
Name:Acetylcholinesterase
Type:Enzyme
Mol. Mass.:71812.79
Organism:Electrophorus electricus (Electric eel)
Description:n/a
Residue:633
BDBM8961
BDBM8959
NameBDBM8961
Synonyms:1,2,3,4-tetrahydro-9-acridinamine 9-THA CHEMBL1337960 Cognex Tracine cid_1935 | tacrine.HCl
TypeSmall organic molecule
Emp. Form.C13H14N2
Mol. Mass.198.2637
SMILESNc1c2CCCCc2nc2ccccc12